BDBM50400982 CHEMBL2205715
SMILES Ic1ccc(CNCC2C3CC4CC(C3)CC2C4)cc1
InChI Key InChIKey=AIBMIAMAEIKRTM-UHFFFAOYSA-N
Data  1 KI
  Tab Delimited (TSV)   2D SDfile   Computed 3D by Vconf -m prep SDfile
Find this compound or compounds like it in BindingDB:
Activity Spreadsheet -- Enzyme Inhibition Constant Data from BindingDB
Found 1 hit for monomerid = 50400982
TargetC-X-C chemokine receptor type 3(Homo sapiens (Human))
Vu University Amsterdam
Curated by ChEMBL
LigandPNGBDBM50400982(CHEMBL2205715)
Affinity DataKi:  2.51E+3nM. Assay description: Displacement of [125I]-CXCL10 from human CXCR3 expressed in HEK293 cells
In DepthDetails ArticlePubMed